Trirhenium nonachloride

Gas phase ion energetics data

Data compiled as indicated in comments:
LLK - Sharon G. Lias, Rhoda D. Levin, and Sherif A. Kafafi
RDSH - Henry M. Rosenstock, Keith Draxl, Bruce W. Steiner, and John T. Herron

Ionization energy determinations

IE (eV) Method Reference Comment
8.7PEBursten, Cotton, et al., 1980LLK
10.5 ± 0.5EIBuchler, Blackburn, et al., 1966RDSH
9.15 ± 0.05PEBursten, Cotton, et al., 1980Vertical value; LLK

Appearance energy determinations

Ion AE (eV) Other Products MethodReferenceComment
ReCl3+16. ± 0.5?EIBuchler, Blackburn, et al., 1966RDSH
ReCl4+16. ± 0.5?EIBuchler, Blackburn, et al., 1966RDSH
Re2Cl5+13.5 ± 0.5?EIBuchler, Blackburn, et al., 1966RDSH
Re2Cl6+13.5 ± 0.5?EIBuchler, Blackburn, et al., 1966RDSH
Re3Cl8+13. ± 0.5ClEIBuchler, Blackburn, et al., 1966RDSH

References

Bursten, Cotton, et al., 1980
Bursten, B.E.; Cotton, F.A.; Green, J.C.; Seddon, E.A.; Stanley, G.G., Electronic structures photoelectron spectra of the metal atom cluster species Re3Cl9, Re3Br9, and [Re3Cl12]3-, J. Am. Chem. Soc., 1980, 102, 955. [all data]

Buchler, Blackburn, et al., 1966
Buchler, A.; Blackburn, P.E.; Stauffer, J.L., The vaporization of rhenium trichloride and rhenium tribromide, J. Phys. Chem., 1966, 70, 685. [all data]