Zinc, bis(hexafluoroacetylacetonato)-

Gas phase ion energetics data

Data compiled as indicated in comments:
LLK - Sharon G. Lias, Rhoda D. Levin, and Sherif A. Kafafi
RDSH - Henry M. Rosenstock, Keith Draxl, Bruce W. Steiner, and John T. Herron

Ionization energy determinations

IE (eV) Method Reference Comment
10.07 ± 0.05EIReichert, Bancroft, et al., 1970RDSH
10.25PEBrittain and Disch, 1975Vertical value; LLK

Appearance energy determinations

Ion AE (eV) Other Products MethodReferenceComment
C5HO2F6Zn+15.3 ± 0.2?EIReichert, Bancroft, et al., 1970RDSH
C9H2O4F9Zn+11.4 ± 0.1?EIReichert, Bancroft, et al., 1970RDSH

References

Reichert, Bancroft, et al., 1970
Reichert, C.; Bancroft, G.M.; Westmore, J.B., Mass spectral studies of metal chelates. V. Mass spectra and appearance potentials of some fluorine-substituted acetylacetonates, Can. J. Chem., 1970, 48, 1362. [all data]

Brittain and Disch, 1975
Brittain, H.G.; Disch, R.L., The He(I) photoelectron spectra of some bivalent transition metal β-diketonate complexes*, J. Electron Spectrosc. Relat. Phenom., 1975, 7, 475. [all data]