SBCS

Vibrational and/or electronic energy levels

Data compiled by: Marilyn E. Jacox

State:   X

Vib.
sym.
 No.   Approximate
 type of mode
 cm-1   Med.   Method   References

1201.9 Ar IR Hassanzadeh, Andrews, et al., 1993
Zhou, Kong, et al., 2004

Additional references: Jacox, 1998, page 249

References

Hassanzadeh, Andrews, et al., 1993
Hassanzadeh, P.; Andrews, L.; Davy, R.D., Laser ablated boron atom reaction with carbon disulfide: infrared spectrum of SBCS in solid argon and ab initio geometry and frequency calculations for possible products, J. Phys. Chem., 1993, 97, 29, 7412, https://doi.org/10.1021/j100131a006 . [all data]

Zhou, Kong, et al., 2004
Zhou, M.; Kong, Q.; Jin, X.; Zeng, A.; Chen, M.; Xu, Q., Infrared Spectra and Density Functional Calculations of the BCS and B(CS), J. Phys. Chem. A, 2004, 108, 50, 11014, https://doi.org/10.1021/jp045978n . [all data]

Jacox, 1998
Jacox, M.E., Vibrational and electronic energy levels of polyatomic transient molecules: supplement A, J. Phys. Chem. Ref. Data, 1998, 27, 2, 115-393, https://doi.org/10.1063/1.556017 . [all data]