2-Undecanol, acetate

Normal alkane RI, non-polar column, temperature ramp

Data compiled by: NIST Mass Spectrometry Data Center, William E. Wallace, director

Column type Capillary
Active phase SE-30
Column length (m) 10.
Carrier gas
Substrate
Column diameter (mm) 0.25
Phase thickness (μm)
Tstart (C) 20.
Tend (C) 200.
Heat rate (K/min) 4.
Initial hold (min)
Final hold (min)
I 1416.
ReferenceYaacob, Abdullah, et al., 1989
Comment MSDC-RI

References

Yaacob, Abdullah, et al., 1989
Yaacob, K.B.; Abdullah, C.M.; Joulain, D., Essential Oil of Ruta graveolens L., J. Essent. Oil Res., 1989, 1, 5, 203-207, https://doi.org/10.1080/10412905.1989.9697787 . [all data]