N-[(4-ethoxyphenyl)methylene]-4-propoxybenzenamine

Phase change data

Data compiled by: Thermodynamics Research Center, NIST Boulder Laboratories, Chris Muzny director

Quantity Value Units Method Reference Comment
Tfus400.5KN/AGrasso, Abate, et al., 1983Crystal phase 1 phase; Uncertainty assigned by TRC = 0.2 K

In addition to the Thermodynamics Research Center (TRC) data available from this site, much more physical and chemical property data is available from the following TRC products:

References

Grasso, Abate, et al., 1983
Grasso, D.; Abate, L.; Gandolfo, C.; Fasone, S., transition entropies and mesomorphic behaviour of p-n-alkoxybenzyliden-p'-propoxyanilines, Thermochim. Acta, 1983, 61, 227. [all data]