Chromium, pentacarbonyl(triphenylphosphine)-

Gas phase ion energetics data

Data compiled by: Sharon G. Lias, Rhoda D. Levin, and Sherif A. Kafafi

Ionization energy determinations

IE (eV) Method Reference Comment
7.40 ± 0.05EIPaetzold and Abd-el-Mottaleb, 1975
7.30PEDaamen, Oskam, et al., 1980Vertical value

Appearance energy determinations

Ion AE (eV) Other Products MethodReferenceComment
C18H15PCr+10.95COEITorroni, Innorta, et al., 1974
C19H15OPCr+9.74COEITorroni, Innorta, et al., 1974
C20H15O2PCr+9.33COEITorroni, Innorta, et al., 1974
C21H15O3PCr+9.12COEITorroni, Innorta, et al., 1974
C22H15O4PCr+8.5COEITorroni, Innorta, et al., 1974

References

Paetzold and Abd-el-Mottaleb, 1975
Paetzold, R.; Abd-el-Mottaleb, S., Correlative studies of some spectroscopic and bonding parameters in octahedrally coordinated metal carbonyl complexes, J. Mol. Struct., 1975, 24, 357. [all data]

Daamen, Oskam, et al., 1980
Daamen, H.; Oskam, A.; Stufkens, D.J., U.V. photoelectron (He I and He II) studies of M(CO)5PR3 (M = Cr, W and R = C6H11, C6H5, O-i-C3H7, OC6H5) and W(CO)5As(C6H5)3, Inorg. Chim. Acta, 1980, 38, 71. [all data]

Torroni, Innorta, et al., 1974
Torroni, S.; Innorta, G.; Foffani, A.; Distefano, G., Interpretation of the mass spectra of substituted chromium and tungsten carbonyls by means of appearance potential measurements, J. Organomet. Chem., 1974, 65, 209. [all data]