Tris(di-n-butyldithiocarbamato)antimony(III)

Condensed phase thermochemistry data

Data compiled by: Eugene S. Domalski and Elizabeth D. Hearing

Constant pressure heat capacity of solid

Cp,solid (J/mol*K) Temperature (K) Reference Comment
1049.298.15Airoldi and De Souza, 1989T = 330 to 340 K.

Phase change data

Data compiled as indicated in comments:
AC - William E. Acree, Jr., James S. Chickos
DH - Eugene S. Domalski and Elizabeth D. Hearing

Quantity Value Units Method Reference Comment
Δsub42.8 ± 0.7kcal/molN/ALiebman, Simões, et al., 1994AC

Enthalpy of fusion

ΔfusH (kcal/mol) Temperature (K) Reference Comment
8.9006343.Airoldi and De Souza, 1989DH

References

Airoldi and De Souza, 1989
Airoldi, C.; De Souza, A.G., Thermochemical properties of chelates of di-n-butyldithiocarbamate with phosphorus-group elements, J. Chem. Thermodynam., 1989, 21, 283-291. [all data]