titanium tetrahydride

Vibrational and/or electronic energy levels

Data compiled by: Marilyn E. Jacox

State:   X

Vib.
sym.
 No.   Approximate
 type of mode
 cm-1   Med.   Method   References

TiH stretch 1663.8 Ar IR Xiao, Hauge, et al., 1991
Chertihin and Andrews, 1994
TiH stretch 1656.7 Ar IR Xiao, Hauge, et al., 1991
Chertihin and Andrews, 1994
TiH stretch 1657.8 T Kr IR Xiao, Hauge, et al., 1991

Additional references: Jacox, 1994, page 227; Jacox, 1998, page 265

References

Xiao, Hauge, et al., 1991
Xiao, Z.L.; Hauge, R.H.; Margrave, J.L., Reactions of vanadium and titanium with molecular hydrogen in krypton and argon matrixes at 12 K, J. Phys. Chem., 1991, 95, 7, 2696, https://doi.org/10.1021/j100160a015 . [all data]

Chertihin and Andrews, 1994
Chertihin, G.V.; Andrews, L., Reactions of Laser Ablated Ti Atoms with Hydrogen during Condensation in Excess Argon. Infrared Spectra of the TiH, TiH2, TiH3, and TiH4 Molecules, J. Am. Chem. Soc., 1994, 116, 18, 8322, https://doi.org/10.1021/ja00097a045 . [all data]

Jacox, 1994
Jacox, M.E., Vibrational and electronic energy levels of polyatomic transient molecules, American Chemical Society, Washington, DC, 1994, 464. [all data]

Jacox, 1998
Jacox, M.E., Vibrational and electronic energy levels of polyatomic transient molecules: supplement A, J. Phys. Chem. Ref. Data, 1998, 27, 2, 115-393, https://doi.org/10.1063/1.556017 . [all data]