3-Buten-2-one, 4-(2,6,6-trimethyl-1-cyclohexen-1-yl)-

Van Den Dool and Kratz RI, non-polar column, custom temperature program

Data compiled by: NIST Mass Spectrometry Data Center, William E. Wallace, director

Column type CapillaryCapillaryCapillary
Active phase DB-5DB-5DB-5
Column length (m) 30.30.30.
Carrier gas HeHeHe
Substrate
Column diameter (mm) 0.320.320.32
Phase thickness (μm) 1.1.1.
Program 40C(2min) => 5C/min => 100C => 4C/min => 230C (10min)40C(2min) => 5C/min => 100C => 4C/min => 230C (10min)40C (2min) => 5C/min => 100C => 4C/min => 230C (10min)
I 1486.1493.1496.
ReferenceWang, Finn, et al., 2005Wang, Finn, et al., 2005Klesk, Qian, et al., 2004
Comment MSDC-RI MSDC-RI MSDC-RI

References

Wang, Finn, et al., 2005
Wang, Y.; Finn, C.; Qian, M.C., Impact of Growing Environment on Chickasaw Blackberry ( Rubus L.) Aroma Evaluated by Gas Chromatography Olfactometry Dilution Analysis, J. Agric. Food Chem., 2005, 53, 9, 3563-3571, https://doi.org/10.1021/jf048102m . [all data]

Klesk, Qian, et al., 2004
Klesk, K.; Qian, M.; Martin, R.R., Aroma extract dilution analysis of cv. meeker (Rubus idaeus L.) red raspberries from Oregon and Washington, J. Agric. Food Chem., 2004, 52, 16, 5155-5161, https://doi.org/10.1021/jf0498721 . [all data]