Iron, tetracarbonyldiiodo-

Phase change data

Data compiled by: William E. Acree, Jr., James S. Chickos

Quantity Value Units Method Reference Comment
Δsub20.6 ± 0.96kcal/molN/APilcher and Skinner, 1983See also Connor, Demain, et al., 1979.

References

Pilcher and Skinner, 1983
Pilcher, G.; Skinner, H.A., Thermochemistry of organometallic compounds, 1983, 43-90, https://doi.org/10.1002/9780470771686.ch2 . [all data]

Connor, Demain, et al., 1979
Connor, Joseph A.; Demain, Christopher P.; Skinner, Henry A.; Zafarani-Moattar, Mohammad T., Thermochemistry of η3-Allyltricarbonyliodoiron, Tricarbonyl (η4-cyclooctatetraene)iron and Tetracarbonyldiiodoiron. The Enthalpy Contributions of Allyliron and Cyclooctatetraene-iron Bonds, Journal of Organometallic Chemistry, 1979, 170, 1, 117-130, https://doi.org/10.1016/S0022-328X(00)83195-2 . [all data]