Iron,tris(2,2,6,6-tetramethyl-3,5-heptanedionato-o,o')-

Gas phase ion energetics data

Data compiled as indicated in comments:
LL - Sharon G. Lias and Joel F. Liebman
LLK - Sharon G. Lias, Rhoda D. Levin, and Sherif A. Kafafi

Ionization energy determinations

IE (eV) Method Reference Comment
8.05PEShcheka and Vovna, 1992Vertical value; LL
7.92 ± 0.07PEEvans, Hamnett, et al., 1972Vertical value; LLK

References

Shcheka and Vovna, 1992
Shcheka, O.L.; Vovna, V.I., Electronic structure of some copper(II) and iron(III) -diketonates, J. Electron Spectrosc. Relat. Phenom., 1992, 60, 211. [all data]

Evans, Hamnett, et al., 1972
Evans, S.; Hamnett, A.; Orchard, A.F.; Lloyd, D.R., Study of the metal-oxygen bond in simple tris-chelate complexes by He(I) photoelectron spectroscopy, Faraday Discuss. Chem. Soc., 1972, 54, 227. [all data]