Norephedrine, (.+/-.)-

Kovats' RI, non-polar column, isothermal

View large format table.

Column type Active phase Temperature (C) I Reference Comment
PackedApiezon L150.1347.Donike and Stratmann, 1976Chromosorb W

Kovats' RI, polar column, isothermal

View large format table.

Column type Active phase Temperature (C) I Reference Comment
PackedPEG-20M180.2195.Donike and Stratmann, 1976Chromosorb W

Normal alkane RI, non-polar column, temperature ramp

View large format table.

Column type Active phase I Reference Comment
CapillaryDB-11313.Yashiki, Kojima, et al., 199530. m/0.25 mm/0.25 μm, He, 40. C @ 2. min, 25. K/min, 250. C @ 5. min
PackedSE-301350.Marozzi, Gambaro, et al., 1982Gas Chrom P, 2.5 K/min; Column length: 2. m; Tstart: 120. C; Tend: 200. C

References

Donike and Stratmann, 1976
Donike, M.; Stratmann, D., Gas-chromatographische identifizierung von stimulantien der phenyläthylaminreihe mit hilfe der retnetions-indices, Z. Anal. Chem., 1976, 279, 2, 129-131, https://doi.org/10.1007/BF00440798 . [all data]

Yashiki, Kojima, et al., 1995
Yashiki, M.; Kojima, T.; Miyazaki, T.; Nagasawa, N.; Iwasaki, Y.; Hara, K., Detection of amphetamines in urine using head space-solid phase microextraction and chemical ionization selected ion monitoring, Forensic Sci. Int., 1995, 76, 3, 169-177, https://doi.org/10.1016/0379-0738(95)01819-0 . [all data]

Marozzi, Gambaro, et al., 1982
Marozzi, E.; Gambaro, V.; Saligari, E.; Mariani, R.; Lodi, F., Use of the retention index in gas chromatographic studies of drugs, J. Anal. Toxicol., 1982, 6, 4, 185-192, https://doi.org/10.1093/jat/6.4.185 . [all data]