Neodymium tris(bis(trimethylsilyl)amide)

Gas phase ion energetics data

Data compiled by: Sharon G. Lias, John E. Bartmess, Joel F. Liebman, John L. Holmes, Rhoda D. Levin, and W. Gary Mallard

Ionization energy determinations

IE (eV) Method Reference Comment
7.5PEGreen, Payne, et al., 1982
8.19PEGreen, Payne, et al., 1982Vertical value

References

Green, Payne, et al., 1982
Green, J.C.; Payne, M.; Seddon, E.A.; Andersen, R.A., He-I and He-II photoelectron studies of bonding in metal silylamido-complexes, M[N(SiMe3)2]n (n = 1, 2, or 3), J. Chem. Soc. Dalton Trans., 1982, 887. [all data]