2-Octanone, 7-methyl-

Kovats' RI, polar column, temperature ramp

View large format table.

Column type Active phase I Reference Comment
CapillaryCarbowax 20M1337.Tressl, Friese, et al., 1978He, 2. K/min; Column length: 50. m; Column diameter: 0.28 mm; Tstart: 70. C; Tend: 190. C

Normal alkane RI, non-polar column, temperature ramp

View large format table.

Column type Active phase I Reference Comment
CapillaryUltra-21057.Schlumpberger B.O., Clery R.A., et al., 200650. m/0.25 mm/0.32 μm, He, 2. K/min; Tstart: 50. C; Tend: 270. C

References

Tressl, Friese, et al., 1978
Tressl, R.; Friese, L.; Fendesack, F.; Köppler, H., Studies of the volatile composition of hops during storage, J. Agric. Food Chem., 1978, 26, 6, 1426-1430, https://doi.org/10.1021/jf60220a036 . [all data]

Schlumpberger B.O., Clery R.A., et al., 2006
Schlumpberger B.O.; Clery R.A.; Barthlott W., A unique cactus with scented and possibly bat-dispersed fruits: Rhipsalis juengeri, Plant Biology, 2006, 8, 2, 265-270, https://doi.org/10.1055/s-2005-873045 . [all data]