HBCH

Vibrational and/or electronic energy levels

Data compiled by: Marilyn E. Jacox

State:   X

Vib.
sym.
 No.   Approximate
 type of mode
 cm-1   Med.   Method   References

Σ+ 1 CH stretch 3248.8 Ar IR Hassanzadeh, Hannachi, et al., 1993
2 BH stretch 2724.6 Ar IR Hassanzadeh, Hannachi, et al., 1993
3 B=C stretch 1475.3 Ar IR Hassanzadeh, Hannachi, et al., 1993

Additional references: Jacox, 1998, page 221

References

Hassanzadeh, Hannachi, et al., 1993
Hassanzadeh, P.; Hannachi, Y.; Andrews, L., Pulsed laser evaporated boron atom reactions with methane. 2. Infrared spectra of H2CBH2, H2CBH, HCBH, and HBCBH in solid argon, J. Phys. Chem., 1993, 97, 24, 6418, https://doi.org/10.1021/j100126a016 . [all data]

Jacox, 1998
Jacox, M.E., Vibrational and electronic energy levels of polyatomic transient molecules: supplement A, J. Phys. Chem. Ref. Data, 1998, 27, 2, 115-393, https://doi.org/10.1063/1.556017 . [all data]