(+)β-Desmotroposantonin acetate
- Formula: C17H20O4
- Molecular weight: 288.3383
- IUPAC Standard InChIKey: ZWPKGSNVVQTUMS-UHFFFAOYSA-N
- CAS Registry Number: 14794-69-5
- Chemical structure:

Condensed phase thermochemistry data

Data compiled by: Hussein Y. Afeefy, Joel F. Liebman, and Stephen E. Stein
Quantity | Value | Units | Method | Reference | Comment |
---|---|---|---|---|---|
ΔfH°solid | -879.3 ± 1.8 | kJ/mol | Ccb | Cocker, McMurry, et al., 1964 | |
Quantity | Value | Units | Method | Reference | Comment |
ΔcH°solid | -8668.7 ± 1.8 | kJ/mol | Ccb | Cocker, McMurry, et al., 1964 | Corresponding ΔfHºsolid = -879.23 kJ/mol (simple calculation by NIST; no Washburn corrections) |

References

Cocker, McMurry, et al., 1964
Cocker, W.; McMurry, T.B.H.; Frisch, M.A.; McAllister, T.; Mackle, H.,
Stabilities of some santonin derivatives,
Tetrahedron Lett., 1964, 23, 2235-2237. [all data]