3,7-Diazabicyclo[3.3.1]nonane, 3,7-dimethyl-

Gas phase ion energetics data

Data compiled as indicated in comments:
LLK - Sharon G. Lias, Rhoda D. Levin, and Sherif A. Kafafi

Ionization energy determinations

IE (eV) Method Reference Comment
6.8PELivant, Roberts, et al., 1981LLK
7.84PELivant, Roberts, et al., 1981Vertical value; LLK

References

Livant, Roberts, et al., 1981
Livant, P.; Roberts, K.A.; Eggers, M.D.; Worley, S.D., The gas phase conformation of 3,7-dimethyl-3,7-diazabicyclo[3.3.1]nonane, Tetrahedron, 1981, 37, 1853. [all data]