Benzenamine, 2,4,6-tribromo-

Normal alkane RI, non-polar column, temperature ramp

Data compiled by: NIST Mass Spectrometry Data Center, William E. Wallace, director

Column type CapillaryCapillaryCapillaryCapillaryCapillary
Active phase TR-1TR-1TR-1TR-1TR-1
Column length (m) 30.30.30.30.30.
Carrier gas HeliumHeliumHeliumHeliumHelium
Substrate
Column diameter (mm) 0.320.320.320.320.32
Phase thickness (μm) 0.250.250.250.250.25
Tstart (C) 50.50.50.50.50.
Tend (C) 300.300.300.300.300.
Heat rate (K/min) 5.5.5.5.5.
Initial hold (min)
Final hold (min)
I 1642.1644.1646.1646.1646.
ReferenceGruzdev, Alferova, et al., 2011Gruzdev, Alferova, et al., 2011Gruzdev, Alferova, et al., 2011Gruzdev, Alferova, et al., 2011Gruzdev, Alferova, et al., 2011
Comment MSDC-RI MSDC-RI MSDC-RI MSDC-RI MSDC-RI
Column type CapillaryCapillaryCapillaryCapillaryCapillary
Active phase TR-1TR-1TR-1TR-1Ultra-1
Column length (m) 30.30.30.30.25.
Carrier gas HeliumHeliumHeliumHeliumHe
Substrate
Column diameter (mm) 0.320.320.320.320.32
Phase thickness (μm) 0.250.250.250.250.25
Tstart (C) 50.50.50.50.80.
Tend (C) 300.300.300.300.260.
Heat rate (K/min) 5.5.5.5.3.
Initial hold (min)
Final hold (min)
I 1648.1651.1646.1646.1635.
ReferenceGruzdev, Alferova, et al., 2011Gruzdev, Alferova, et al., 2011Gruzdev, Alferova, et al., 2011, 2Gruzdev, Filippova, et al., 2011Okumura, 1991
Comment MSDC-RI MSDC-RI MSDC-RI MSDC-RI MSDC-RI

Phase change data

Data compiled as indicated in comments:
BS - Robert L. Brown and Stephen E. Stein
TRC - Thermodynamics Research Center, NIST Boulder Laboratories, Chris Muzny director
AC - William E. Acree, Jr., James S. Chickos
ALS - Hussein Y. Afeefy, Joel F. Liebman, and Stephen E. Stein

Quantity Value Units Method Reference Comment
Tboil573.2KN/AWeast and Grasselli, 1989BS
Quantity Value Units Method Reference Comment
Tfus393.KN/ASnyder and Geller, 1952Uncertainty assigned by TRC = 3. K; TRC
Tfus394.85KN/AFew and Smith, 1949Uncertainty assigned by TRC = 0.25 K; TRC
Tfus395.KN/ARobertson, 1902Uncertainty assigned by TRC = 3. K; TRC
Quantity Value Units Method Reference Comment
Δsub96.7 ± 1.7kJ/molCRibeiro da Silva, Ferreira, et al., 2006AC
Δsub101.1 ± 1.1kJ/molCAllot and Finch, 1987The mean of Heat of formations recomended by author; ALS

Enthalpy of fusion

ΔfusH (kJ/mol) Temperature (K) Method Reference Comment
25.75393.DSCRibeiro da Silva, Ferreira, et al., 2006AC

In addition to the Thermodynamics Research Center (TRC) data available from this site, much more physical and chemical property data is available from the following TRC products:

Gas phase thermochemistry data

Data compiled by: Hussein Y. Afeefy, Joel F. Liebman, and Stephen E. Stein

Quantity Value Units Method Reference Comment
Δfgas38.00 ± 0.62kcal/molCcrAllot and Finch, 1987The mean of Heat of formations recomended by author

Condensed phase thermochemistry data

Data compiled as indicated in comments:
ALS - Hussein Y. Afeefy, Joel F. Liebman, and Stephen E. Stein
DH - Eugene S. Domalski and Elizabeth D. Hearing

Quantity Value Units Method Reference Comment
Δfsolid13.8 ± 0.57kcal/molCcrAllot and Finch, 1987The mean of Heat of formations recomended by author; ALS
Quantity Value Units Method Reference Comment
Δcsolid-714.29 ± 0.76kcal/molCcrAllot and Finch, 1987The mean of Heat of formations recomended by author; ALS

Constant pressure heat capacity of solid

Cp,solid (cal/mol*K) Temperature (K) Reference Comment
43.36298.15Allot and Finch, 1987Cp given as 0.55 J/g*K.; DH

References

Gruzdev, Alferova, et al., 2011
Gruzdev, I.V.; Alferova, M.V.; Kondratenok, B.M.; Zenkevich, I.G., Gas-chromatographic identification of chloro- and bromosubstituted anilines using retention indices, Rus. J. Anal. Chem., 2011, 66, 5, 519-524. [all data]

Gruzdev, Alferova, et al., 2011, 2
Gruzdev, I.V.; Alferova, M.V.; Kondratenok, B.M.; Zenkevich, I.G., Quantification of chloroanilines in drinking water by gas chromatography as bromo derivatives, Rus. J. Anal. Chem., 2011, 66, 10, 955-962, https://doi.org/10.1134/S1061934811100042 . [all data]

Gruzdev, Filippova, et al., 2011
Gruzdev, I.V.; Filippova, M.V.; Zenkevich, I.G.; Kondratenok, B.M., Identification of bromination products of chlorosubstituted anilines in aqueous media by using gas chromatography, Rus. J. Applied Chem., 2011, 84, 10, 1656-1667, https://doi.org/10.1134/S1070427211100132 . [all data]

Okumura, 1991
Okumura, T., retention indices of environmental chemicals on methyl silicone capillary column, Journal of Environmental Chemistry (Japan), 1991, 1, 2, 333-358, https://doi.org/10.5985/jec.1.333 . [all data]