C60F44 fullerene radical

Gas phase ion energetics data

Data compiled by: John E. Bartmess

Electron affinity determinations

EA (eV) Method Reference Comment
4.06 ± 0.25IMRBHettich, Jin, et al., 1994EA between NO3-, CF3CO2-

References

Hettich, Jin, et al., 1994
Hettich, R.; Jin, C.M.; Compton, R., Determination of the electron affinities of fluorinated fullerenes (C60F44,46, C70F52,54) by Fourier transform mass spectrometry, Int. J. Mass Spectrom. Ion Proc., 1994, 138, 263, https://doi.org/10.1016/0168-1176(94)04059-1 . [all data]