Benzene, 1,4-dimethoxy-2-methyl-5-isopropyl-

Normal alkane RI, non-polar column, custom temperature program

Data compiled by: NIST Mass Spectrometry Data Center, William E. Wallace, director

Column type CapillaryCapillary
Active phase DB-5CP Sil 8 CB
Column length (m) 30.50.
Carrier gas HeliumHe
Substrate
Column diameter (mm) 0.250.32
Phase thickness (μm) 0.250.25
Program 50 0C m6 0C/min -> 140 0C 5 0C/min -> 160 0C (1 min) 10 0C/min -> 200 0C50C(5min) => 2C/min => 90C => 15C/min => 240C(4min)
I 1415.1423.
ReferenceCourtois, Paine, et al., 2009Butkienë, Nivinskienë, et al., 2005
Comment MSDC-RI MSDC-RI

References

Courtois, Paine, et al., 2009
Courtois, E.A.; Paine, C.E.; Blandinieres, P.-A.; Stien, D.; Bessiere, J.-M.; Houel, E.; Baraloto, C.; Chave, J., Diversity of the volatile organic compounds emitted by 55 species of tropical trees: a survey in French Guiana, J. Chem. Ecol., 2009, 35, 11, 1349-1362, https://doi.org/10.1007/s10886-009-9718-1 . [all data]

Butkienë, Nivinskienë, et al., 2005
Butkienë, R.; Nivinskienë, O.; Mockutë, D., α-Pinene chemotype of leaf (needle) essential oils of Juniperus communis L. growing wild in Vilnius district, Chemija, 2005, 16, 1, 53-60. [all data]