Heneicosane, 11-pentyl-

Phase change data

Data compiled as indicated in comments:
TRC - Thermodynamics Research Center, NIST Boulder Laboratories, Chris Muzny director
AC - William E. Acree, Jr., James S. Chickos

Quantity Value Units Method Reference Comment
Tfus264.05KN/AAnonymous, 1968TRC
Tfus264.1KN/ASchiessler, 1947Uncertainty assigned by TRC = 0.6 K; TRC
Tfus264.1KN/AWhitmore, Cosby, et al., 1942Uncertainty assigned by TRC = 0.6 K; TRC

Enthalpy of vaporization

ΔvapH (kJ/mol) Temperature (K) Method Reference Comment
96.3493.A,MGStephenson and Malanowski, 1987Based on data from 478. - 512. K. See also Schiessler and Whitmore, 1955.; AC

In addition to the Thermodynamics Research Center (TRC) data available from this site, much more physical and chemical property data is available from the following TRC products:

Van Den Dool and Kratz RI, non-polar column, temperature ramp

View large format table.

Column type Active phase I Reference Comment
CapillaryDB-12453.Khorasheh, Gray, et al., 198935. C @ 3. min, 3. K/min; Tend: 300. C

References

Anonymous, 1968
Anonymous, R., Properties of hydrocarbon of high molecular weight, Am. Pet. Inst. Res. Proj. 42, Penn. State Univ., 1968. [all data]

Schiessler, 1947
Schiessler, R.W., , Am. Pet. Inst. Res. Proj. 42, Twelfth Meeting, 1947. [all data]

Whitmore, Cosby, et al., 1942
Whitmore, F.C.; Cosby, J.N.; Sloatman, W.S.; Clarke, D.G., Higher Hydrocarbons. II. Five 11-substituted heneicosanes., J. Am. Chem. Soc., 1942, 64, 1801. [all data]

Stephenson and Malanowski, 1987
Stephenson, Richard M.; Malanowski, Stanislaw, Handbook of the Thermodynamics of Organic Compounds, 1987, https://doi.org/10.1007/978-94-009-3173-2 . [all data]

Schiessler and Whitmore, 1955
Schiessler, R.W.; Whitmore, F.C., Properties of High Molecular Weight Hydrocarbons, Ind. Eng. Chem., 1955, 47, 8, 1660-1665, https://doi.org/10.1021/ie50548a054 . [all data]

Khorasheh, Gray, et al., 1989
Khorasheh, F.; Gray, M.R.; Selucky, M.L., Correlation for Kováts retention index of C9-C26 monoalkyl and polymethyl alkanes and alkenes, J. Chromatogr., 1989, 481, 1-16, https://doi.org/10.1016/S0021-9673(01)96747-0 . [all data]