Manganate(1-), tricarbonyl-

Reaction thermochemistry data

Data compiled by: John E. Bartmess

Individual Reactions

C3MnO3 + Carbon monoxide = C3MnO3-

By formula: C3MnO3 + CO = C3MnO3-

Quantity Value Units Method Reference Comment
Δr119. ± 13.kJ/molCIDTSunderlin, Wang, et al., 1993gas phase

References

Sunderlin, Wang, et al., 1993
Sunderlin, L.S.; Wang, D.N.; Squires, R.R., Bond Strengths in 1st-Row-Metal Carbonyl Anions, J. Am. Chem. Soc., 1993, 115, 25, 12060, https://doi.org/10.1021/ja00078a051 . [all data]