Heptane, 2,2,4-trimethyl-

Phase change data

Data compiled as indicated in comments:
TRC - Thermodynamics Research Center, NIST Boulder Laboratories, Chris Muzny director
AC - William E. Acree, Jr., James S. Chickos

Quantity Value Units Method Reference Comment
Tboil419.15KN/ABraun, Spooner, et al., 1950Uncertainty assigned by TRC = 1.5 K; TRC
Tboil422.55KN/AMoersch and Whitmore, 1949Uncertainty assigned by TRC = 2. K; TRC
Tboil425.12KN/ABrooks, Cleaton, et al., 1937Uncertainty assigned by TRC = 1. K; identification uncertain - might be 2,2,5-trimethylheptane; TRC
Quantity Value Units Method Reference Comment
Δvap45.6kJ/molN/AReid, 1972AC

In addition to the Thermodynamics Research Center (TRC) data available from this site, much more physical and chemical property data is available from the following TRC products:

Henry's Law data

Data compiled by: Rolf Sander

Henry's Law constant (water solution)

kH(T) = H exp(d(ln(kH))/d(1/T) ((1/T) - 1/(298.15 K)))
H = Henry's law constant for solubility in water at 298.15 K (mol/(kg*bar))
d(ln(kH))/d(1/T) = Temperature dependence constant (K)

H (mol/(kg*bar)) d(ln(kH))/d(1/T) (K) Method Reference Comment
0.00016 QN/A missing citation give several references for the Henry's law constants but don't assign them to specific species.

Kovats' RI, non-polar column, isothermal

Data compiled by: NIST Mass Spectrometry Data Center, William E. Wallace, director

Column type CapillaryCapillaryCapillaryCapillaryCapillary
Active phase SqualaneSqualaneVacuum Grease Oil (VM-4)SqualaneSqualane
Column length (m)   150.50.91.4
Carrier gas   N2H2N2
Substrate
Column diameter (mm)   0.250.20.25
Phase thickness (μm)
Temperature (C) 100.60.95.100.60.
I 876.875.7875.3900.876.
ReferenceHeinzen, Soares, et al., 1999Chretien and Dubois, 1976Sultanov and Arustamova, 1975Mitra, Mohan, et al., 1974Matukuma, 1969
Comment MSDC-RI MSDC-RI MSDC-RI MSDC-RI MSDC-RI

Normal alkane RI, non-polar column, temperature ramp

Data compiled by: NIST Mass Spectrometry Data Center, William E. Wallace, director

Column type CapillaryCapillary
Active phase Polydimethyl siloxane: CP-Sil 5 CBPetrocol DH
Column length (m) 60.100.
Carrier gas HeliumHelium
Substrate
Column diameter (mm) 0.250.25
Phase thickness (μm) 1.00.50
Tstart (C) 45.20.
Tend (C) 210.220.
Heat rate (K/min) 3.615.
Initial hold (min) 1.4515.
Final hold (min) 2.7230.
I 884.883.
ReferenceBramston-Cook, 2013Supelco, 2012
Comment MSDC-RI MSDC-RI

Kovats' RI, non-polar column, temperature ramp

View large format table.

Column type Active phase I Reference Comment
CapillaryDB-5875.Ramarathnam, Rubin, et al., 1993He, 30. C @ 2. min, 10. K/min, 280. C @ 3. min; Column length: 30. m; Column diameter: 0.13 mm
CapillaryDB-5875.Ramarathnam, Rubin, et al., 1993, 2He, 30. C @ 2. min, 10. K/min, 280. C @ 3. min; Column length: 30. m; Column diameter: 0.13 mm

Kovats' RI, non-polar column, custom temperature program

View large format table.

Column type Active phase I Reference Comment
CapillaryDB-1889.Hoekman, 199360. m/0.32 mm/1.0 μm, He; Program: -40 C for 12 min; -40 - 125 C at 3 deg.min; 125-185 C at 6 deg/min; 185 - 220 C at 20 deg/min; hold 220 C for 2 min
CapillarySqualane874.Korol and Lysyuk, 1980Program: not specified

Van Den Dool and Kratz RI, non-polar column, temperature ramp

View large format table.

Column type Active phase I Reference Comment
CapillaryOV-101889.9Yin, Liu, et al., 2001N2, 1. K/min; Column length: 80. m; Column diameter: 0.22 mm; Tstart: 30. C; Tend: 130. C

Van Den Dool and Kratz RI, non-polar column, custom temperature program

View large format table.

Column type Active phase I Reference Comment
CapillaryOV-101890.Wu and Lu, 1984Program: not specified

Normal alkane RI, non-polar column, custom temperature program

View large format table.

Column type Active phase I Reference Comment
CapillaryOV-101876.Du and Liang, 2003Program: not specified
CapillaryPolydimethyl siloxane876.Junkes, Castanho, et al., 2003Program: not specified
CapillaryPolydimethyl siloxanes890.Yin, Guo, et al., 2001Program: not specified

References

Braun, Spooner, et al., 1950
Braun, W.G.; Spooner, D.F.; Fenske, M.R., Raman spectra hydrocarbons and oxygenated compounds, Anal. Chem., 1950, 22, 1074. [all data]

Moersch and Whitmore, 1949
Moersch, G.W.; Whitmore, F.C., Hydrocarbons: ix 2,2,4-trimethylheptane, 2,2,4-trimethyloctane, 2,2,4,6- tetramethylheptane and 2,2,4,5,5-pentamethylhexane, J. Am. Chem. Soc., 1949, 71, 819-21. [all data]

Brooks, Cleaton, et al., 1937
Brooks, D.B.; Cleaton, R.B.; Carter, F.R., Paraffin Hydrocarbons Isolated from Crude Synthetic Isooctane (2,2,4-Trimethylpentane), J. Res. Natl. Bur. Stand. (U. S.), 1937, 19, 319. [all data]

Reid, 1972
Reid, Robert C., Handbook on vapor pressure and heats of vaporization of hydrocarbons and related compounds, R. C. Wilhort and B. J. Zwolinski, Texas A Research Foundation. College Station, Texas(1971). 329 pages.$10.00, AIChE J., 1972, 18, 6, 1278-1278, https://doi.org/10.1002/aic.690180637 . [all data]