Dibromofluoroborane(3)

Gas phase thermochemistry data

Quantity Value Units Method Reference Comment
Δfgas-514.63kJ/molReviewChase, 1998Data last reviewed in December, 1964
Quantity Value Units Method Reference Comment
gas,1 bar309.99J/mol*KReviewChase, 1998Data last reviewed in December, 1964

Gas Phase Heat Capacity (Shomate Equation)

Cp° = A + B*t + C*t2 + D*t3 + E/t2
H° − H°298.15= A*t + B*t2/2 + C*t3/3 + D*t4/4 − E/t + F − H
S° = A*ln(t) + B*t + C*t2/2 + D*t3/3 − E/(2*t2) + G
    Cp = heat capacity (J/mol*K)
    H° = standard enthalpy (kJ/mol)
    S° = standard entropy (J/mol*K)
    t = temperature (K) / 1000.

View plot Requires a JavaScript / HTML 5 canvas capable browser.

View table.

Temperature (K) 298. - 1100.1100. - 6000.
A 48.5306382.56622
B 76.697320.322219
C -66.30468-0.065085
D 20.688580.004499
E -0.333120-3.564928
F -533.0834-549.0705
G 346.7436395.2788
H -514.6320-514.6320
ReferenceChase, 1998Chase, 1998
Comment Data last reviewed in December, 1964 Data last reviewed in December, 1964

Gas phase ion energetics data

Data compiled by: Henry M. Rosenstock, Keith Draxl, Bruce W. Steiner, and John T. Herron

Ionization energy determinations

IE (eV) Method Reference
11.11 ± 0.10EILappert, Litzow, et al., 1968

References

Chase, 1998
Chase, M.W., Jr., NIST-JANAF Themochemical Tables, Fourth Edition, J. Phys. Chem. Ref. Data, Monograph 9, 1998, 1-1951. [all data]

Lappert, Litzow, et al., 1968
Lappert, M.F.; Litzow, M.R.; Pedley, J.B.; Riley, P.N.K.; Tweedale, A., Bonding studies of compounds of boron and the group IV elements. Part II. Ionisation potentials of boron halides and mixed halides by electron impact and by molecular orbital calculations, J. Chem. Soc., 1968, (A), 3105. [all data]