Bromodifluoroborane(3)

Gas phase thermochemistry data

Quantity Value Units Method Reference Comment
Δfgas-820.06kJ/molReviewChase, 1998Data last reviewed in December, 1964
Quantity Value Units Method Reference Comment
gas,1 bar286.39J/mol*KReviewChase, 1998Data last reviewed in December, 1964

Gas Phase Heat Capacity (Shomate Equation)

Cp° = A + B*t + C*t2 + D*t3 + E/t2
H° − H°298.15= A*t + B*t2/2 + C*t3/3 + D*t4/4 − E/t + F − H
S° = A*ln(t) + B*t + C*t2/2 + D*t3/3 − E/(2*t2) + G
    Cp = heat capacity (J/mol*K)
    H° = standard enthalpy (kJ/mol)
    S° = standard entropy (J/mol*K)
    t = temperature (K) / 1000.

View plot Requires a JavaScript / HTML 5 canvas capable browser.

View table.

Temperature (K) 298. - 1100.1100. - 6000.
A 36.1877182.10807
B 98.884660.577103
C -82.10096-0.116505
D 24.816850.008053
E -0.230106-5.067744
F -835.3440-858.0715
G 302.8312366.0000
H -820.0640-820.0640
ReferenceChase, 1998Chase, 1998
Comment Data last reviewed in December, 1964 Data last reviewed in December, 1964

References

Chase, 1998
Chase, M.W., Jr., NIST-JANAF Themochemical Tables, Fourth Edition, J. Phys. Chem. Ref. Data, Monograph 9, 1998, 1-1951. [all data]