Pyrrolo[1,2-a]pyrazine-1,4-dione, hexahydro-3-(phenylmethyl)-

Normal alkane RI, non-polar column, temperature ramp

View large format table.

Column type Active phase I Reference Comment
CapillaryDB-11935.Gautschi, Schmid, et al., 199730. m/0.25 mm/1.0 μm, He, 5. K/min; Tstart: 60. C; Tend: 270. C

References

Gautschi, Schmid, et al., 1997
Gautschi, M.; Schmid, J.P.; Peppard, T.L.; Ryan, T.P.; Tuorto, R.M.; Yang, X., Chemical characterization of diketopiperazines in beer, J. Agric. Food Chem., 1997, 45, 8, 3183-3189, https://doi.org/10.1021/jf9700992 . [all data]