Zirconium ion (1+)

Gas phase thermochemistry data

Quantity Value Units Method Reference Comment
gas,1 bar183.64J/mol*KReviewChase, 1998Data last reviewed in March, 1984

Reaction thermochemistry data

Data compiled by: Robert C. Dunbar

Individual Reactions

Zirconium ion (1+) + Carbon monosulfide = (Zirconium ion (1+) • Carbon monosulfide)

By formula: Zr+ + CS = (Zr+ • CS)

Quantity Value Units Method Reference Comment
Δr258. ± 11.kJ/molCIDTRodgers and Armentrout, 2000

Ion clustering data

Data compiled by: Robert C. Dunbar

Clustering reactions

Zirconium ion (1+) + Carbon monosulfide = (Zirconium ion (1+) • Carbon monosulfide)

By formula: Zr+ + CS = (Zr+ • CS)

Quantity Value Units Method Reference Comment
Δr61.7 ± 2.6kcal/molCIDTRodgers and Armentrout, 2000

References

Chase, 1998
Chase, M.W., Jr., NIST-JANAF Themochemical Tables, Fourth Edition, J. Phys. Chem. Ref. Data, Monograph 9, 1998, 1-1951. [all data]

Rodgers and Armentrout, 2000
Rodgers, M.T.; Armentrout, P.B., Noncovalent Metal-Ligand Bond Energies as Studied by Threshold Collision-Induced Dissociation, Mass Spectrom. Rev., 2000, 19, 4, 215, https://doi.org/10.1002/1098-2787(200007)19:4<215::AID-MAS2>3.0.CO;2-X . [all data]