1,2-Dicarbadodecaborane(12)-1-carboperoxoic acid 2-(1-methylethyl)-1,1-dimethyl-2-propynyl ester

Phase change data

Data compiled by: William E. Acree, Jr., James S. Chickos

Enthalpy of sublimation

ΔsubH (kJ/mol) Temperature (K) Method Reference
125.1 ± 7.0345. - 362.MEDibrivnyi, Pistun, et al., 1999

References

Dibrivnyi, Pistun, et al., 1999
Dibrivnyi, V.N.; Pistun, Z.E.; Van Chin Syan, Yu.Ya.; Yuvchenko, A.P.; Zvereva, T.D., Enthalpies of vapor formation of some acetylene peroxy derivatives of carboranes-12, Zh. Fiz. Khim., 1999, 73, 12, 2257. [all data]