Heptane, 3-ethyl-2-methyl-

Van Den Dool and Kratz RI, non-polar column, temperature ramp

Data compiled by: NIST Mass Spectrometry Data Center, William E. Wallace, director

Column type CapillaryCapillary
Active phase DB-5OV-101
Column length (m) 30.108.
Carrier gas He
Substrate
Column diameter (mm) 0.250.25
Phase thickness (μm) 1.0.2
Tstart (C) 50.35.
Tend (C) 200.200.
Heat rate (K/min) 2.51.
Initial hold (min)
Final hold (min)
I 942.4946.
ReferenceXu, van Stee, et al., 2003Hayes and Pitzer, 1981
Comment MSDC-RI MSDC-RI

References

Xu, van Stee, et al., 2003
Xu, X.; van Stee, L.L.P.; Williams, J.; Beens, J.; Adahchour, M.; Vreuls, R.J.J.; Brinkman, U.A.Th.; Lelieveld, J., Comprehensive two-dimensional gas chromatography (GC×GC) measurements of volatile organic compounds in the atmosphere, Atmos. Chem. Phys., 2003, 3, 3, 665-682, https://doi.org/10.5194/acp-3-665-2003 . [all data]

Hayes and Pitzer, 1981
Hayes, P.C., Jr.; Pitzer, E.W., Kovats indices as a tool in characterizing hydrocarbon fuels in temperature programmed glass capillary gas chromatography. Part 1. Qualitative identification, Inhouse rpt. for Air Force Wright Aeronautical Labs., Air Force Wright Aeronautical Labs., Wright-Patterson AFB, Ohio, 1981, 75. [all data]