Iron, tetracarbonyl(triphenylphosphine)-

Gas phase ion energetics data

Data compiled by: Sharon G. Lias, Rhoda D. Levin, and Sherif A. Kafafi

Ionization energy determinations

IE (eV) Method Reference Comment
7.55PEFlamini, Semprini, et al., 1978Vertical value

References

Flamini, Semprini, et al., 1978
Flamini, A.; Semprini, E.; Stefani, F.; Cardaci, G.; Bellachioma, G.; Andreocci, M., He(I) photoelectron spectra of tetracarbonyliron complexes of group 5 ligands and of olefinic ligands, J. Chem. Soc. Dalton Trans., 1978, 695. [all data]