1-Butyne, 3,3-dimethyl-1-trimethylsilyl-
- Formula: C9H18Si
- Molecular weight: 154.3247
- IUPAC Standard InChIKey: GKWFJPNWRGGCSB-UHFFFAOYSA-N
- CAS Registry Number: 14630-42-3
- Chemical structure:

Gas phase ion energetics data

Data compiled by: Henry M. Rosenstock, Keith Draxl, Bruce W. Steiner, and John T. Herron
Ionization energy determinations
IE (eV) | Method | Reference |
---|---|---|
9.35 ± 0.04 | EI | Bock and Seidl, 1968 |

References

Bock and Seidl, 1968
Bock, H.; Seidl, H.,
d-Orbital effects in siliconsubstituted π-electron systems. Part XII. Some spectroscopic properties of alkyl and silyl acetylenes and polyacetylenes,
J. Chem. Soc. B, 1968, 1158. [all data]