4,4-Dimethoxybutyronitrile

Condensed phase thermochemistry data

Data compiled as indicated in comments:
ALS - Hussein Y. Afeefy, Joel F. Liebman, and Stephen E. Stein
DH - Eugene S. Domalski and Elizabeth D. Hearing

Quantity Value Units Method Reference Comment
Δfliquid-311.2 ± 2.6kJ/molCcbNurullaev and Karasharli, 1981ALS
Quantity Value Units Method Reference Comment
Δcliquid-3622.3 ± 2.6kJ/molCcbNurullaev and Karasharli, 1981ALS
Quantity Value Units Method Reference Comment
liquid295.6J/mol*KN/AGeidarov, Karasharli, et al., 1983DH

Constant pressure heat capacity of liquid

Cp,liquid (J/mol*K) Temperature (K) Reference Comment
253.63298.15Geidarov, Karasharli, et al., 1983T = 55 to 300 K.; DH

Phase change data

Data compiled by: Eugene S. Domalski and Elizabeth D. Hearing

Quantity Value Units Method Reference Comment
Tfus154.KN/AGeidarov, Karasharli, et al., 1983Glassy (solid) to liquid transition.

Normal alkane RI, non-polar column, custom temperature program

View large format table.

Column type Active phase I Reference Comment
CapillaryTR-5 MS1020.Kurashov, Mitrukova, et al., 201415. m/0.25 mm/0.25 μm, Helium; Program: 35 0C (3 min) 2 0C/min -> 60 0C (3 min) 2 0C/min -> 80 0C (3 min) 4 0C/min -> 120 0C (3 min) 5 0C/min -> 150 0C (3 min) 15 0C/min -> 240 0C (10 min)

References

Nurullaev and Karasharli, 1981
Nurullaev, G.G.; Karasharli, K.A., Thermochemical study of β-cyanopropionaldehyde dimethyl acetal and methyl α-cyanopropinate, Azerb. Khim. Zh., 1981, 140-144. [all data]

Geidarov, Karasharli, et al., 1983
Geidarov, Kh.I.; Karasharli, K.I.; Guseinov, Z.A., Study of the true heat capacity of the dimethyl acetal of β-cyanopropionaldehyde in the temperature range 55-300K, Azerb. Khim. Zhur., 1983, (5), 98-101. [all data]

Kurashov, Mitrukova, et al., 2014
Kurashov, E.A.; Mitrukova, G.G.; Krylova, Yu.V., Variations in the component composition of essential oil of Ceratophyllum demersum (Ceratophyllaceae) during vegetation (in press), Plant Resources (Rastitel'nye Resursy), 2014, 1, 000-000. [all data]