Agarospirol

Van Den Dool and Kratz RI, non-polar column, temperature ramp

View large format table.

Column type Active phase I Reference Comment
CapillaryHP-5MS1646.Saroglou, Dorizas, et al., 200630. m/0.25 mm/0.25 μm, He, 60. C @ 5. min, 4. K/min; Tend: 280. C

Van Den Dool and Kratz RI, non-polar column, custom temperature program

View large format table.

Column type Active phase I Reference Comment
CapillaryHP-5MS1642.1Andriamaharavo, 201430. m/0.25 mm/0.25 μm, He; Program: 60C (1 min) => 5 C/min => 210C => 10 C/min => 280C (15 min)

Normal alkane RI, non-polar column, temperature ramp

View large format table.

Column type Active phase I Reference Comment
CapillaryDB-51643.Boukhris, Bouaziz, et al., 201230. m/0.25 mm/0.25 μm, Helium, 100. C @ 1. min, 10. K/min, 260. C @ 10. min
CapillaryHP-11628.Wetwiayaklung, Thavanapong, et al., 200925. m/0.32 mm/0.17 μm, 50. C @ 5. min, 1. K/min, 260. C @ 5. min
CapillaryHP-5 MS1646.Adams, Beauchamp, et al., 200730. m/0.25 mm/0.25 μm, Helium, 50. C @ 10. min, 3. K/min, 230. C @ 10. min
CapillaryCP Sil 8 CB1679.Suárez, Vásquez, et al., 2005He, 60. C @ 5. min, 3. K/min; Column length: 30. m; Column diameter: 0.25 mm; Tend: 290. C

Normal alkane RI, non-polar column, custom temperature program

View large format table.

Column type Active phase I Reference Comment
CapillaryHP-51620.Custer, 200925. m/0.32 mm/0.17 μm, Helium; Program: 60 0C (5 min) 4 0C/min -> 220 0C 11 0C/min -> 280 0C (15 min)
CapillaryHP-51648.Custer, 200925. m/0.32 mm/0.17 μm, Helium; Program: not specified
CapillaryHP-11631.Wetwiayaklung, Thavanapong, et al., 200925. m/0.32 mm/0.17 μm; Program: not specified
CapillaryRTX-51639.Zachariah, Leela, et al., 200830. m/0.25 mm/0.25 μm, Helium; Program: 60 0C (5 min) 5 0C/min -> 110 0C 3 0C/min -> 220 0C (5 min)
CapillaryDB-11631.Ishihara, Tsuneya, et al., 1993Program: not specified

References

Saroglou, Dorizas, et al., 2006
Saroglou, V.; Dorizas, N.; Kypriotakis, Z.; Skaltsa, H.D., Analysis of the essential oil composition of eight Anthemis species from Greece, J. Chromatogr. A, 2006, 1104, 1-2, 313-322, https://doi.org/10.1016/j.chroma.2005.11.087 . [all data]

Andriamaharavo, 2014
Andriamaharavo, N.R., Retention Data. NIST Mass Spectrometry Data Center., NIST Mass Spectrometry Data Center, 2014. [all data]

Boukhris, Bouaziz, et al., 2012
Boukhris, M.; Bouaziz, M.; Feki, I.; Jemai, H.; El Feki, A.; Sayadi, S., Hypoglycemic and antioxidant effects of leaf essential oil of Pelargonium graveolens L'Her. in alloxan induced diabetic rats, Lipids in Health and Disease, 2012, 11, 1, 1-10, https://doi.org/10.1186/1476-511X-11-81 . [all data]

Wetwiayaklung, Thavanapong, et al., 2009
Wetwiayaklung, P.; Thavanapong, N.; Charoenteeraboon, J., Chemical constituents and antimicrobial activity os essential oil and extracts of heartwood of Aquilaria crassna obtained from water distillation and supercritical fluid carbon dioxide extraction, Silpakorn U Sci. J., 2009, 3, 1, 25-33. [all data]

Adams, Beauchamp, et al., 2007
Adams, R.P.; Beauchamp, P.S.; Dev, V.; Dutz, S.M., New Natural Products Isolated from One-Seeded Juniperus of the Southwestern United States: Isolation and Occurence of 2-Ethenyl-3-methyl Phanol and Its Derivatives, J. Essent. Oil Res., 2007, 19, 2, 146-152, https://doi.org/10.1080/10412905.2007.9699247 . [all data]

Suárez, Vásquez, et al., 2005
Suárez, A.I.; Vásquez, L.J.; Manzano, M.A.; Compagnone, R.S., Essential oil composition of Croton cuneatus and Croton malambo growing in Venezuela, Flavour Fragr. J., 2005, 20, 6, 611-614, https://doi.org/10.1002/ffj.1498 . [all data]

Custer, 2009
Custer, Y., GC Volatile Components Analysis of Different Parts of Litchi chinensis (Dissertation), 2009. [all data]

Zachariah, Leela, et al., 2008
Zachariah, T.J.; Leela, N.K.; Maya, K.M.; Rema, J.; Mathew, P.A.; Vipin, T.M.; Krishnamoorthy, B., Chemical composition of leaf oils of Myristica beddomeii (King), Myristica fragrans (Houtt.) and Myristica malabarica (Lamk.), J. Spices Arom. Crops, 2008, 17, 1, 10-15. [all data]

Ishihara, Tsuneya, et al., 1993
Ishihara, M.; Tsuneya, T.; Uneyama, K., Components of the Volatile Concentrate of Agarwood, J. Essent. Oil Res., 1993, 5, 3, 283-289, https://doi.org/10.1080/10412905.1993.9698221 . [all data]