p-(Adamantyl-1)toluene

Kovats' RI, non-polar column, isothermal

View large format table.

Column type Active phase Temperature (C) I Reference Comment
PackedPMS-1000230.1941.Arutyunov, Kudryashov, et al., 2004N2, Chromaton N-AW-DMCS; Column length: 2. m
CapillarySE-30180.1868.Sarkisova and Pimerzin, 2001He; Column length: 25. m; Column diameter: 0.25 mm

References

Arutyunov, Kudryashov, et al., 2004
Arutyunov, Y.I.; Kudryashov, S.Y.; Onuchak, L.A., Analysis of Mixtures Containing Unknown Components by Gas Chromatography: Determination of Molecular Mass, J. Anal. Chem. USSR (Engl. Transl.), 2004, 59, 4, 358-365. [all data]

Sarkisova and Pimerzin, 2001
Sarkisova, V.S.; Pimerzin, A.A., Synthesis, identification, and gas chromatographic characterization of some isomeric aryladamantanes, Pet. Chem. USSR (Engl. Transl.), 2001, 41, 5, 342-345. [all data]