Benzene, tetradecyl-

Kovats' RI, non-polar column, isothermal

View large format table.

Column type Active phase Temperature (C) I Reference Comment
CapillaryOV-101210.2082.Kusmierz, Malinski, et al., 1985Column length: 22. m; Column diameter: 0.3 mm
CapillarySE-52210.2089.9Kusmierz, Malinski, et al., 1985He; Column length: 40. m; Column diameter: 0.3 mm

Normal alkane RI, non-polar column, temperature ramp

View large format table.

Column type Active phase I Reference Comment
CapillaryRTX-12056.Arey J.S., Nelson R.K., et al., 20057. m/0.1 mm/0.4 μm, 35. C @ 5. min, 0.66 K/min; Tend: 180. C

References

Kusmierz, Malinski, et al., 1985
Kusmierz, J.; Malinski, E.; Czerwiec, W.; Szafranek, J., Kováts retention indices of high-molecular-weight monomethyl-, cyclopentyl-, cyclohexyl- and phenylalkanes, J. Chromatogr., 1985, 331, 219-228, https://doi.org/10.1016/0021-9673(85)80027-3 . [all data]

Arey J.S., Nelson R.K., et al., 2005
Arey J.S.; Nelson R.K.; Xu L.; Reddy C.M., Using comprehensive two-dimensional gas chromatography retention indices to estimate environmental partitioning properties for a complete set of diesel fuel hydrocarbons, Anal. Chem., 2005, 77, 22, 7172-7182, https://doi.org/10.1021/ac051051n . [all data]