2-Pentene, 4-chloro-

Reaction thermochemistry data

Data compiled by: Hussein Y. Afeefy, Joel F. Liebman, and Stephen E. Stein

Individual Reactions

2-Chloro-2-pentene = 2-Pentene, 4-chloro-

By formula: C5H9Cl = C5H9Cl

Quantity Value Units Method Reference Comment
Δr-1.5kcal/molEqkShishinova, Levanova, et al., 1978liquid phase; Heat of isomerization

Normal alkane RI, non-polar column, temperature ramp

View large format table.

Column type Active phase I Reference Comment
CapillaryOV-101742.Zenkevich, 200525. m/0.20 mm/0.10 μm, N2/He, 6. K/min; Tstart: 50. C; Tend: 250. C

References

Shishinova, Levanova, et al., 1978
Shishinova, V.I.; Levanova, S.V.; Shevtsova, L.A.; Rozhnov, A.M., The isomerisation of halogenoalkenes, Russ. J. Phys. Chem. (Engl. Transl.), 1978, 52, 1065-1066. [all data]

Zenkevich, 2005
Zenkevich, I.G., Experimentally measured retention indices., 2005. [all data]