21H,23H-Porphin,5,10,15,20-tetrakis(4-methylphenyl)-
- Formula: C48H38N4
- Molecular weight: 670.8421
- IUPAC Standard InChIKey: SFQNUQLWBBZIOZ-PJEPRTEXSA-N
- CAS Registry Number: 14527-51-6
- Chemical structure:

Phase change data

Data compiled by: Hussein Y. Afeefy, Joel F. Liebman, and Stephen E. Stein
Quantity | Value | Units | Method | Reference | Comment |
---|---|---|---|---|---|
ΔsubH° | 260.4 | kJ/mol | E | Wu, Xu, et al., 1989 | see 62LI/LUO |

Condensed phase thermochemistry data

Data compiled by: Hussein Y. Afeefy, Joel F. Liebman, and Stephen E. Stein

Quantity Value Units Method Reference Comment
Δfsolid479. ± 10.kJ/molCcbWu, Xu, et al., 1989see 62LI/LUO
Quantity Value Units Method Reference Comment
Δcsolid-24797.8 ± 8.1kJ/molCcbWu, Xu, et al., 1989see 62LI/LUO

References

Wu, Xu, et al., 1989
Wu, D.; Xu, G.; Qu, S.; Xue, R.; Gu, C.; Zhang, F.,
Standard enthalpies of combustion and formation of porphyrin derivatives,
Thermochim. Acta, 1989, 154, 233-245. [all data]