Iron, tris(1,1,1-trifluoro-2,4-pentanedionato)-

Phase change data

Data compiled by: William E. Acree, Jr., James S. Chickos

Enthalpy of vaporization

ΔvapH (kcal/mol) Temperature (K) Reference Comment
20.8 ± 0.29410.Chumachenko, Igumenov, et al., 1978Based on data from 392. - 428. K.

Enthalpy of sublimation

ΔsubH (kcal/mol) Temperature (K) Method Reference
22.9373. - 403.TGAFahlman and Barron, 2000
25.0 ± 0.2378. - 438.GSMatsubara and Kuwamoto, 1985
19.2433.N/AVolkov, Mazurenko, et al., 1978
30.81345.N/AGötze, Bloss, et al., 1970

Gas phase ion energetics data

Data compiled as indicated in comments:
LL - Sharon G. Lias and Joel F. Liebman
LLK - Sharon G. Lias, Rhoda D. Levin, and Sherif A. Kafafi
RDSH - Henry M. Rosenstock, Keith Draxl, Bruce W. Steiner, and John T. Herron

Ionization energy determinations

IE (eV) Method Reference Comment
8.9 ± 0.2PEWestmore, Reimer, et al., 1981LLK
8.83 ± 0.05EIWestmore, Reimer, et al., 1981LLK
9.10 ± 0.05EIReichert, Bancroft, et al., 1970RDSH
9.38 ± 0.11EISchildcrout, Pearson, et al., 1968RDSH
9.1PEShcheka and Vovna, 1992Vertical value; LL
9.18 ± 0.07PEEvans, Hamnett, et al., 1972Vertical value; LLK

Appearance energy determinations

Ion AE (eV) Other Products MethodReferenceComment
C10H8O4F6Fe+9.2 ± 0.1?EIReichert, Bancroft, et al., 1970RDSH

References

Chumachenko, Igumenov, et al., 1978
Chumachenko, Y.V.; Igumenov, I.K.; Zemskov, S.V., Russ. J. Phys. Chem., 1978, 52, 1393. [all data]

Fahlman and Barron, 2000
Fahlman, Bradley D.; Barron, Andrew R., Substituent effects on the volatility of metal ?-diketonates, Adv. Mater. Opt. Electron., 2000, 10, 3-5, 223-232, https://doi.org/10.1002/1099-0712(200005/10)10:3/5<223::AID-AMO411>3.0.CO;2-M . [all data]

Matsubara and Kuwamoto, 1985
Matsubara, Norio; Kuwamoto, Tooru, Vapor pressures and enthalpies of sublimation and evaporation of trifluoroacetylacetonates in helium and helium containing the ligand vapor, Inorg. Chem., 1985, 24, 17, 2697-2701, https://doi.org/10.1021/ic00211a022 . [all data]

Volkov, Mazurenko, et al., 1978
Volkov, S.V.; Mazurenko, E.A.; Bublik, Z.N., Effect of the nature of substituents in β-diketonates on their thermodynamic characteristics, Str., Svoistva Primen. β [Beta]-Diketonatov Met., [Mater. Vses. Semin.], 3rd, V.I. Spitsyn, ed(s)., 1978, 119-122. [all data]

Götze, Bloss, et al., 1970
Götze, H.-J.; Bloss, K.; Molketin, H., Dampfdruckbestimmung von Acetylacetonaten, Zeitschrift für Physikalische Chemie, 1970, 73, 46, 314-320, https://doi.org/10.1524/zpch.1970.73.46.314 . [all data]

Westmore, Reimer, et al., 1981
Westmore, J.B.; Reimer, M.L.J.; Reichert, C., Ionization energies of metal chelates. Acetylacetonates, trifluoroacetylacetonates, and hexafluoroacetylacetonates of trivalent metals of the first transition series, Can. J. Chem., 1981, 59, 1797. [all data]

Reichert, Bancroft, et al., 1970
Reichert, C.; Bancroft, G.M.; Westmore, J.B., Mass spectral studies of metal chelates. V. Mass spectra and appearance potentials of some fluorine-substituted acetylacetonates, Can. J. Chem., 1970, 48, 1362. [all data]

Schildcrout, Pearson, et al., 1968
Schildcrout, S.M.; Pearson, R.G.; Stafford, F.E., Ionization potentials of tris(-diketonate)metal(III) complexes and Koopmans' theorem, J. Am. Chem. Soc., 1968, 90, 4006. [all data]

Shcheka and Vovna, 1992
Shcheka, O.L.; Vovna, V.I., Electronic structure of some copper(II) and iron(III) -diketonates, J. Electron Spectrosc. Relat. Phenom., 1992, 60, 211. [all data]

Evans, Hamnett, et al., 1972
Evans, S.; Hamnett, A.; Orchard, A.F.; Lloyd, D.R., Study of the metal-oxygen bond in simple tris-chelate complexes by He(I) photoelectron spectroscopy, Faraday Discuss. Chem. Soc., 1972, 54, 227. [all data]