Arsenic monoxide monochloride

Vibrational and/or electronic energy levels

Data compiled by: Marilyn E. Jacox

State:   X

Vib.
sym.
 No.   Approximate
 type of mode
 cm-1   Med.   Method   References

a' 1 AsO stretch 984.4 Ar IR Schnockel, 1983
3 AsCl stretch 378.7 Ar IR Schnockel, 1983

Additional references: Jacox, 1994, page 104

References

Schnockel, 1983
Schnockel, H., M. Lakenbrink, 1983, and Lin Zhengyan, J. Mol. Struct. 102, 243. [all data]

Jacox, 1994
Jacox, M.E., Vibrational and electronic energy levels of polyatomic transient molecules, American Chemical Society, Washington, DC, 1994, 464. [all data]