ClBrCl-

Vibrational and/or electronic energy levels

Data compiled by: Marilyn E. Jacox

State:   X

Vib.
sym.
 No.   Approximate
 type of mode
 cm-1   Med.   Method   References

Σu+ 3 Asym. stretch 311 K Ar IR Ault and Andrews, 1976

Additional references: Jacox, 1994, page 119

References

Ault and Andrews, 1976
Ault, B.S.; Andrews, L., Infrared spectra of the M+HBr2- and the M+HClBr- ion pairs and their deuterium analogs isolated in argon matrices at 15 K, J. Chem. Phys., 1976, 64, 5, 1986, https://doi.org/10.1063/1.432463 . [all data]

Jacox, 1994
Jacox, M.E., Vibrational and electronic energy levels of polyatomic transient molecules, American Chemical Society, Washington, DC, 1994, 464. [all data]