thiazole-4-carbonitrile

Gas phase thermochemistry data

Data compiled by: Hussein Y. Afeefy, Joel F. Liebman, and Stephen E. Stein

Quantity Value Units Method Reference Comment
Δfgas293.8 ± 1.3kJ/molCcbMansson and Sunner, 1966Reanalyzed by Cox and Pilcher, 1970, Original value = 294.2 ± 1.2 kJ/mol

Condensed phase thermochemistry data

Data compiled by: Hussein Y. Afeefy, Joel F. Liebman, and Stephen E. Stein

Quantity Value Units Method Reference Comment
Δfsolid219.9 ± 0.92kJ/molCcbMansson and Sunner, 1966Reanalyzed by Cox and Pilcher, 1970, Original value = 220.2 ± 0.79 kJ/mol
Quantity Value Units Method Reference Comment
Δcsolid-2682.1 ± 0.79kJ/molCcbMansson and Sunner, 1966

Phase change data

Data compiled as indicated in comments:
ALS - Hussein Y. Afeefy, Joel F. Liebman, and Stephen E. Stein
AC - William E. Acree, Jr., James S. Chickos

Quantity Value Units Method Reference Comment
Δsub73.93 ± 0.42kJ/molVMansson and Sunner, 1966ALS
Δsub73.9 ± 0.4kJ/molCMansson and Sunner, 1966See also Cox and Pilcher, 1970, 2.; AC

References

Mansson and Sunner, 1966
Mansson, M.; Sunner, S., Heats of combustion and formation of 4-methylthiazole and 4-cyanothiazole, Acta Chem. Scand., 1966, 20, 845-848. [all data]

Cox and Pilcher, 1970
Cox, J.D.; Pilcher, G., Thermochemistry of Organic and Organometallic Compounds, Academic Press, New York, 1970, 1-636. [all data]

Cox and Pilcher, 1970, 2
Cox, J.D.; Pilcher, G., Thermochemistry of Organic and Organometallic Compounds, Academic Press Inc., London, 1970, 643. [all data]