Strontium monobromide

Gas phase thermochemistry data

Quantity Value Units Method Reference Comment
Δfgas-89.12kJ/molReviewChase, 1998Data last reviewed in December, 1974
Quantity Value Units Method Reference Comment
gas,1 bar263.75J/mol*KReviewChase, 1998Data last reviewed in December, 1974

Gas Phase Heat Capacity (Shomate Equation)

Cp° = A + B*t + C*t2 + D*t3 + E/t2
H° − H°298.15= A*t + B*t2/2 + C*t3/3 + D*t4/4 − E/t + F − H
S° = A*ln(t) + B*t + C*t2/2 + D*t3/3 − E/(2*t2) + G
    Cp = heat capacity (J/mol*K)
    H° = standard enthalpy (kJ/mol)
    S° = standard entropy (J/mol*K)
    t = temperature (K) / 1000.

View plot Requires a JavaScript / HTML 5 canvas capable browser.

View table.

Temperature (K) 298. - 1500.1500. - 6000.
A 37.3248448.81096
B 0.732254-8.879703
C -0.1697592.564119
D 0.049331-0.171695
E -0.059857-5.671705
F -100.4796-113.4341
G 308.3721314.0573
H -89.11920-89.11920
ReferenceChase, 1998Chase, 1998
Comment Data last reviewed in December, 1974 Data last reviewed in December, 1974

Gas phase ion energetics data

Data compiled as indicated in comments:
LL - Sharon G. Lias and Joel F. Liebman
LBLHLM - Sharon G. Lias, John E. Bartmess, Joel F. Liebman, John L. Holmes, Rhoda D. Levin, and W. Gary Mallard
LLK - Sharon G. Lias, Rhoda D. Levin, and Sherif A. Kafafi

Ionization energy determinations

IE (eV) Method Reference Comment
5.56 ± 0.06EVALBelyaev, Gotkis, et al., 1990LL
5.13 ± 0.23CIMeyer, Schulze, et al., 1984LBLHLM
5.5PEHildenbrand, 1977LLK

References

Chase, 1998
Chase, M.W., Jr., NIST-JANAF Themochemical Tables, Fourth Edition, J. Phys. Chem. Ref. Data, Monograph 9, 1998, 1-1951. [all data]