2,4-Decadien-1-ol

Normal alkane RI, non-polar column, temperature ramp

Data compiled by: NIST Mass Spectrometry Data Center, William E. Wallace, director

Column type Capillary
Active phase DB-1
Column length (m) 50.
Carrier gas N2
Substrate
Column diameter (mm) 0.25
Phase thickness (μm) 0.25
Tstart (C) 60.
Tend (C) 240.
Heat rate (K/min) 3.
Initial hold (min)
Final hold (min)
I 1233.
ReferenceVelasco-Negueruela, Pérez-Alonso, et al., 2002
Comment MSDC-RI

References

Velasco-Negueruela, Pérez-Alonso, et al., 2002
Velasco-Negueruela, A.; Pérez-Alonso, M.J.; Palá-Paúl, J.; Íñigo, A.; López, G., Leaf essential oils analysis of Juniperus navicularis Gandoger, Botanica Complutensis, 2002, 26, 85-91. [all data]