Disilane, 1,2-diethenyl-1,1,2,2-tetramethyl-

Gas phase ion energetics data

Data compiled as indicated in comments:
LLK - Sharon G. Lias, Rhoda D. Levin, and Sherif A. Kafafi

Ionization energy determinations

IE (eV) Method Reference Comment
8.63PEKhvostenko, Zykov, et al., 1981Vertical value; LLK

References

Khvostenko, Zykov, et al., 1981
Khvostenko, V.I.; Zykov, B.G.; Yuriev, V.P.; Mironov, V.F.; Kovel'zon, G.I.; Panasenko, A.A.; Sheludyakov, V.D.; Gailyunas, I.A., Study of d(π)-p(π) interaction in vinyl- and alkylsilicon-containing compounds by photoelectron spectroscopy, J. Organomet. Chem., 1981, 218, 155. [all data]

Petukhov, et al., 1979
Petukhov, V.A., et al., Zhur. Obshchei Khim., 1979, 49, 1054. [all data]