C8H6F3NO4S

Reaction thermochemistry data

Data compiled by: John E. Bartmess

Individual Reactions

C8H5F3NO4S- + Hydrogen cation = C8H6F3NO4S

By formula: C8H5F3NO4S- + H+ = C8H6F3NO4S

Quantity Value Units Method Reference Comment
Δr1322.6kJ/molIMREZhang, Badal, et al., 2013gas phase

Gas phase ion energetics data

Data compiled by: John E. Bartmess

De-protonation reactions

C8H5F3NO4S- + Hydrogen cation = C8H6F3NO4S

By formula: C8H5F3NO4S- + H+ = C8H6F3NO4S

Quantity Value Units Method Reference Comment
Δr1322.6kJ/molIMREZhang, Badal, et al., 2013gas phase

References

Zhang, Badal, et al., 2013
Zhang, M.; Badal, M.M.R.; Koppel, I.A.; Mishima, M., Gas-Phase Acidities of alpha- and alpha,alpha-SO2CF3-Substituted Toluenes. Varying Resonance Demand in the Electron-Rich System, Bull. Chem. Soc. Japan, 2013, 86, 7, 813-820, https://doi.org/10.1246/bcsj.20130052 . [all data]