p-Toluidine-phenol complex

Condensed phase thermochemistry data

Data compiled by: Eugene S. Domalski and Elizabeth D. Hearing

Constant pressure heat capacity of solid

Cp,solid (J/mol*K) Temperature (K) Reference
216.7293.Campbell and Campbell, 1940

References

Campbell and Campbell, 1940
Campbell, A.N.; Campbell, A.J.R., The heats of solution, heats of formation, specific heats and equilibrium diagrams of certain molecular compounds. J. Am. Chem. Soc., 1940, 62, 291-297. [all data]