Silane, chloromethyldiphenyl-

Phase change data

Data compiled by: Robert L. Brown and Stephen E. Stein

Quantity Value Units Method Reference Comment
Tboil568.KN/APCR Inc., 1990

Kovats' RI, non-polar column, isothermal

View large format table.

Column type Active phase Temperature (C) I Reference Comment
PackedPolymethylsiloxane, (PMS-20000)50.1675.2Ainshtein and Shulyatieva, 1972He, Chromosorb W; Column length: 2. m

References

PCR Inc., 1990
PCR Inc., Research Chemicals Catalog 1990-1991, PCR Inc., Gainesville, FL, 1990, 1. [all data]