CAS Reg. No. 14478-07-0

Reaction thermochemistry data

Data compiled by: John E. Bartmess

Individual Reactions

(CAS Reg. No. 14478-07-0 • 4294967295Dichloromethylene) + Dichloromethylene = CAS Reg. No. 14478-07-0

By formula: (CAS Reg. No. 14478-07-0 • 4294967295CCl2) + CCl2 = CAS Reg. No. 14478-07-0

Quantity Value Units Method Reference Comment
Δr30.8 ± 2.7kcal/molCIDTPaulino and Squires, 1991gas phase

References

Paulino and Squires, 1991
Paulino, J.A.; Squires, R.R., Carbene Thermochemistry from Collision-Induced Dissociation Threshold Energy Measurements - The Heats of Formation of X1A1 CF2 and X1A1 CCl2, J. Am. Chem. Soc., 1991, 113, 15, 5573, https://doi.org/10.1021/ja00015a009 . [all data]