2-n-Propyladamantane

Kovats' RI, non-polar column, isothermal

View large format table.

Column type Active phase Temperature (C) I Reference Comment
CapillarySE-30145.1371.Bogoslovsky, Anvaer, et al., 1978
CapillarySqualane100.1336.Bogoslovsky, Anvaer, et al., 1978
CapillarySqualane110.1346.Bogoslovsky, Anvaer, et al., 1978
CapillarySqualane125.1353.Bogoslovsky, Anvaer, et al., 1978
CapillarySqualane140.1363.Bogoslovsky, Anvaer, et al., 1978
CapillarySqualane100.1336.Mitra, Mohan, et al., 1974H2; Column length: 50. m; Column diameter: 0.2 mm
CapillarySqualane110.1346.Hála, Eyem, et al., 1970N2; Column length: 50. m; Column diameter: 0.2 mm
CapillarySqualane125.1353.Hála, Eyem, et al., 1970N2; Column length: 50. m; Column diameter: 0.2 mm
CapillarySqualane140.1363.Hála, Eyem, et al., 1970N2; Column length: 50. m; Column diameter: 0.2 mm
CapillarySE-30145.1371.Burkhard, Vais, et al., 1969N2; Column length: 50. m; Column diameter: 0.27 mm
CapillarySE-30160.1384.Burkhard, Vais, et al., 1969N2; Column length: 50. m; Column diameter: 0.27 mm
CapillarySE-30175.1396.Burkhard, Vais, et al., 1969N2; Column length: 50. m; Column diameter: 0.27 mm

Kovats' RI, polar column, isothermal

View large format table.

Column type Active phase Temperature (C) I Reference Comment
CapillaryCarbowax 20M145.1559.Burkhard, Vais, et al., 1969N2; Column length: 50. m; Column diameter: 0.27 mm
CapillaryCarbowax 20M160.1581.Burkhard, Vais, et al., 1969N2; Column length: 50. m; Column diameter: 0.27 mm
CapillaryCarbowax 20M175.1601.Burkhard, Vais, et al., 1969N2; Column length: 50. m; Column diameter: 0.27 mm

Normal alkane RI, non-polar column, custom temperature program

View large format table.

Column type Active phase I Reference Comment
CapillaryPolydimethyl siloxane1371.Bayat and Abad, 2011Program: not specified
CapillaryPolydimethyl siloxane1371.Bayat and Abad M.F.Y., 2011Program: not specified

References

Bogoslovsky, Anvaer, et al., 1978
Bogoslovsky, Yu.N.; Anvaer, B.I.; Vigdergauz, M.S., Chromatographic constants in gas chromatography (in Russian), Standards Publ. House, Moscow, 1978, 192. [all data]

Mitra, Mohan, et al., 1974
Mitra, G.D.; Mohan, G.; Sinha, A., Gas chromatographic analysis of complex hydrocarbon mixtures, J. Chromatogr. A, 1974, 91, 633-648, https://doi.org/10.1016/S0021-9673(01)97944-0 . [all data]

Hála, Eyem, et al., 1970
Hála, S.; Eyem, J.; Burkhard, J.; Landa, S., Retention indices of adamantanes, J. Chromatogr. Sci., 1970, 8, 4, 203-209, https://doi.org/10.1093/chromsci/8.4.203 . [all data]

Burkhard, Vais, et al., 1969
Burkhard, J.; Vais, J.; Vodicka, L.; Landa, S., Adamantane and its derivatives. XVI. The gas chromatographic characterization of adamantane derivatives, J. Chromatogr., 1969, 42, 207-218, https://doi.org/10.1016/S0021-9673(01)80617-8 . [all data]

Bayat and Abad, 2011
Bayat, Z.; Abad, M.F.Y., Quantitative structure-property relationship (QSPR) study of Kovats retention indices of some of adamantane derivatives by the genetic algorithm amd nultiply linear regression (GA-MLR) method, Petroleum Coal, 2011, 53, 2, 132-140. [all data]

Bayat and Abad M.F.Y., 2011
Bayat, Z.; Abad M.F.Y., Computational approaches to the prediction of the Kovats retention index (RI) for adamantane derivatives (AD) as a drug, J. Chem. Pharm. Res., 2011, 3, 1, 48-55. [all data]