2-n-butyladamantane

Kovats' RI, non-polar column, isothermal

Data compiled by: NIST Mass Spectrometry Data Center, William E. Wallace, director

Column type CapillaryCapillaryCapillaryCapillaryCapillary
Active phase SE-30SE-30SE-30SE-30SE-30
Column length (m) 50.
Carrier gas He
Substrate
Column diameter (mm) 0.2
Phase thickness (μm)
Temperature (C) 190.130.140.145.150.
I 1499.1455.1461.1465.1472.
ReferenceSarkisova and Pimerzin, 2005Bogoslovsky, Anvaer, et al., 1978Bogoslovsky, Anvaer, et al., 1978Bogoslovsky, Anvaer, et al., 1978Bogoslovsky, Anvaer, et al., 1978
Comment MSDC-RI MSDC-RI MSDC-RI MSDC-RI MSDC-RI
Column type PackedPackedPackedCapillaryCapillary
Active phase SE-30SE-30SE-30SE-30SE-30
Column length (m) 6.16.16.150.50.
Carrier gas N2N2N2N2N2
Substrate Chrom WChrom WChrom W
Column diameter (mm)    0.270.27
Phase thickness (μm)
Temperature (C) 120.130.140.145.160.
I 1461.1465.1468.1465.1478.
ReferenceMitra, Mohan, et al., 1974Mitra, Mohan, et al., 1974Mitra, Mohan, et al., 1974Burkhard, Vais, et al., 1969Burkhard, Vais, et al., 1969
Comment MSDC-RI MSDC-RI MSDC-RI MSDC-RI MSDC-RI
Column type CapillaryCapillary
Active phase SE-30SE-30
Column length (m) 50.50.
Carrier gas N2N2
Substrate
Column diameter (mm) 0.270.27
Phase thickness (μm)
Temperature (C) 175.190.
I 1489.1499.
ReferenceBurkhard, Vais, et al., 1969Burkhard, Vais, et al., 1969
Comment MSDC-RI MSDC-RI

References

Sarkisova and Pimerzin, 2005
Sarkisova, V.S.; Pimerzin, A.A., Gas chromatographic characteristics and boiling points of diadamantanes, Pet. Chem. USSR (Engl. Transl.), 2005, 45, 1, 63-66. [all data]

Bogoslovsky, Anvaer, et al., 1978
Bogoslovsky, Yu.N.; Anvaer, B.I.; Vigdergauz, M.S., Chromatographic constants in gas chromatography (in Russian), Standards Publ. House, Moscow, 1978, 192. [all data]

Mitra, Mohan, et al., 1974
Mitra, G.D.; Mohan, G.; Sinha, A., Advances in the utilization of the retention index system for characterizing hydrocarbons in complex mixtures by gas chromatography, J. Chromatogr., 1974, 99, 215-230, https://doi.org/10.1016/S0021-9673(00)90857-4 . [all data]

Burkhard, Vais, et al., 1969
Burkhard, J.; Vais, J.; Vodicka, L.; Landa, S., Adamantane and its derivatives. XVI. The gas chromatographic characterization of adamantane derivatives, J. Chromatogr., 1969, 42, 207-218, https://doi.org/10.1016/S0021-9673(01)80617-8 . [all data]